Overview
Features
Download
Documentation
Community
Add-Ons & Services

Compiling Poco in Visual Studio

A general discussion forum.

Compiling Poco in Visual Studio

Postby Polder » 26 Jul 2013, 13:42

I ran into problems while trying to compile Poco with Visual Studio on Windows 7 x64.

I first installed openssl, then I compiled CppUnit_x64_vs110.sln in /poco/CppUnit.

Then I opened Foundation_x64_vs110.sln in /poco/Foundation and did a batch build of all components.

This is build log:
------ Build started: Project: TestApp, Configuration: release_shared x64 ------
TestApp_x64_vs110.vcxproj -> E:\Libraries\poco\Foundation\testsuite\bin64\TestApp.exe
------ Build started: Project: TestApp, Configuration: debug_shared x64 ------
TestApp_x64_vs110.vcxproj -> E:\Libraries\poco\Foundation\testsuite\bin64\TestAppd.exe
------ Build started: Project: TestLibrary, Configuration: release_shared x64 ------
TestPlugin.cpp
Creating library bin64\TestLibrary.lib and object bin64\TestLibrary.exp
TestLibrary_x64_vs110.vcxproj -> E:\Libraries\poco\Foundation\testsuite\bin64\TestLibrary.dll
------ Build started: Project: TestSuite, Configuration: release_static_mt x64 ------
LINK : fatal error LNK1181: cannot open input file 'CppUnitmt.lib'
------ Build started: Project: TestSuite, Configuration: release_static_md x64 ------
LINK : fatal error LNK1181: cannot open input file 'CppUnitmd.lib'
------ Build started: Project: TestSuite, Configuration: release_shared x64 ------
TestPlugin.cpp
LINK : fatal error LNK1181: cannot open input file 'CppUnit.lib'
------ Build started: Project: TestSuite, Configuration: debug_static_mt x64 ------
LINK : fatal error LNK1104: cannot open file 'CppUnitmtd.lib'
------ Build started: Project: TestSuite, Configuration: debug_static_md x64 ------
LINK : fatal error LNK1104: cannot open file 'CppUnitmdd.lib'
------ Build started: Project: TestSuite, Configuration: debug_shared x64 ------
TestPlugin.cpp
TestSuite_x64_vs110.vcxproj -> E:\Libraries\poco\Foundation\testsuite\bin64\TestSuited.exe
========== Build: 4 succeeded, 5 failed, 11 up-to-date, 0 skipped ==========


What else do I need to get this working? Didn't I already build CppUnit?
Polder
 
Posts: 2
Joined: 26 Jul 2013, 13:33

Return to General Discussion

Who is online

Users browsing this forum: No registered users and 2 guests

cron