Overview
Features
Download
Documentation
Community
Add-Ons & Services

building error

Please post support and help requests here.

building error

Postby cform1 » 12 Jul 2007, 14:45

I use win2000 cygwin g++ 2.4.X

and next
I buid poco 1.3.0
$ make -s
** Compiling src/Debugger.cpp (debug, shared)
In file included from src/Debugger.cpp:51:
include/Poco/UnicodeConverter.h:58: error: `std::wstring' has not been declared
include/Poco/UnicodeConverter.h:58: error: ISO C++ forbids declaration of `utf16
String' with no type
include/Poco/UnicodeConverter.h:61: error: `std::wstring' has not been declared
include/Poco/UnicodeConverter.h:61: error: ISO C++ forbids declaration of `utf16
String' with no type
include/Poco/UnicodeConverter.h:64: error: `std::wstring' has not been declared
include/Poco/UnicodeConverter.h:64: error: ISO C++ forbids declaration of `utf16
String' with no type
include/Poco/UnicodeConverter.h:67: error: expected unqualified-id before '&' to
ken
include/Poco/UnicodeConverter.h:67: error: expected `,' or `...' before '&' toke
n
include/Poco/UnicodeConverter.h:67: error: ISO C++ forbids declaration of `param
eter' with no type
make[1]: *** [/mnt/d/poco13data/Foundation/obj/CYGWIN/i686/debug_shared/Debugger
.o] error 1
make: *** [Foundation-libexec] error 2


who can help me
cform1
 
Posts: 4
Joined: 04 Jul 2007, 14:17

Re: building error

Postby petrux » 12 Sep 2007, 16:30

Hi cform1

> I use win2000 cygwin g++ 2.4.X

I'm having the same problem with WinXP and building POCO 1.3.1

> who can help me

I'd like... but I' stuck! :-(
BTW: did you solve the problem meanwhile?

Thanks,
petrux

petrux
 
Posts: 17
Joined: 07 Sep 2007, 15:30


Return to Support

Who is online

Users browsing this forum: No registered users and 1 guest